{"text_format":"1","workbook":"xlsx","n_sheets":10,"sheets":["注意事項","カレンダー ①","カレンダー ② ","ステップ①","ステップ②","ステップ③","ステップ④","条件シート","計算シート","申請書"],"not_rendered":{"charts":0,"images":0,"macros":1,"external_links":0,"defined_names":2,"comments":0,"pivot_tables":0},"unopened":[],"bounds":{"document_bytes":16777216,"sheet_cells":100000,"rows_first":2000,"rows_last":500,"rows_between":2000,"halvings":0,"cell_chars":16384,"cell_head_chars":4096},"cells_cut":0,"cells_raw":0,"read":"whole","date_system":"1900"}

{"sheet":"注意事項","index":0,"n_rows":0,"n_cols":0,"rows_kept":0,"cut":false,"hidden":false,"merged":[]}

{"sheet":"カレンダー ①","index":1,"n_rows":19,"n_cols":127,"rows_kept":19,"cut":false,"hidden":false,"merged":[[18,1,20,2],[18,3,20,6],[3,0,3,6],[5,0,6,0],[13,4,14,4],[13,5,14,5],[13,6,14,6],[13,37,14,37],[13,38,14,38],[3,8,3,14],[3,16,3,22],[3,24,3,30],[3,32,3,38],[5,32,6,32],[5,33,6,33],[5,34,6,34],[13,27,14,27],[13,28,14,28],[13,29,14,29],[13,30,14,30],[5,8,6,8],[5,9,6,9],[5,10,6,10],[5,11,6,11],[15,46,16,46],[5,48,6,48],[13,51,14,51],[13,52,14,52],[13,53,14,53],[13,54,14,54],[15,41,16,41],[15,42,16,42],[15,43,16,43],[15,44,16,44],[15,45,16,45],[5,41,6,41],[5,42,6,42],[5,43,6,43],[5,44,6,44],[15,66,16,66],[15,67,16,67],[15,68,16,68],[15,69,16,69],[15,70,16,70],[5,64,6,64],[5,65,6,65],[5,66,6,66],[5,67,6,67],[5,68,6,68],[5,69,6,69],[3,40,3,46],[3,48,3,54],[3,56,3,62],[3,64,3,70],[3,72,3,78],[13,90,14,90],[13,91,14,91],[13,92,14,92],[13,93,14,93],[5,80,6,80],[5,81,6,81],[5,82,6,82],[5,83,6,83],[5,72,6,72],[5,73,6,73],[13,76,14,76],[13,77,14,77],[13,78,14,78],[13,62,14,62],[5,56,6,56],[5,57,6,57],[5,58,6,58],[5,40,6,40],[3,80,3,86],[3,88,3,94],[3,96,3,102],[3,104,3,110],[3,112,3,118],[13,94,14,94],[5,120,6,120],[13,124,14,124],[13,125,14,125],[5,104,6,104],[5,105,6,105],[5,106,6,106],[5,107,6,107],[5,108,6,108],[3,120,3,126],[5,96,6,96],[5,97,6,97],[13,101,14,101],[13,102,14,102],[13,126,14,126],[15,110,16,110],[5,112,6,112],[13,113,14,113],[13,114,14,114],[13,115,14,115],[13,116,14,116],[13,117,14,117],[13,118,14,118],[15,105,16,105],[15,106,16,106],[15,107,16,107],[15,108,16,108],[15,109,16,109]]}
[]
[]
[]
["2025年 12月",null,null,null,null,null,null,null,"202６年 1月",null,null,null,null,null,null,null,"202６年 2月",null,null,null,null,null,null,null,"202６年 3月",null,null,null,null,null,null,null,"2026年 04月",null,null,null,null,null,null,null,"2026年 05月",null,null,null,null,null,null,null,"2026年 06月",null,null,null,null,null,null,null,"2026年 07月",null,null,null,null,null,null,null,"2026年 08月",null,null,null,null,null,null,null,"2026年 09月",null,null,null,null,null,null,null,"2026年 10月",null,null,null,null,null,null,null,"2026年 11月",null,null,null,null,null,null,null,"2026年 12月",null,null,null,null,null,null,null,"2027年 1月",null,null,null,null,null,null,null,"2027年 2月",null,null,null,null,null,null,null,"2027年 3月"]
["日","月","火","水","木","金","土",null,"日","月","火","水","木","金","土",null,"日","月","火","水","木","金","土",null,"日","月","火","水","木","金","土",null,"日","月","火","水","木","金","土",null,"日","月","火","水","木","金","土",null,"日","月","火","水","木","金","土",null,"日","月","火","水","木","金","土",null,"日","月","火","水","木","金","土",null,"日","月","火","水","木","金","土",null,"日","月","火","水","木","金","土",null,"日","月","火","水","木","金","土",null,"日","月","火","水","木","金","土",null,"日","月","火","水","木","金","土",null,"日","月","火","水","木","金","土",null,"日","月","火","水","木","金","土"]
[null,1,2,3,4,5,6,null,null,null,null,null,1,2,3,null,1,2,3,4,5,6,7,null,1,2,3,4,5,6,7,null,null,null,null,1,2,3,4,null,null,null,null,null,null,1,2,null,null,1,2,3,4,5,6,null,null,null,null,1,2,3,4,null,null,null,null,null,null,null,1,null,null,null,1,2,3,4,5,null,null,null,null,null,1,2,3,null,1,2,3,4,5,6,7,null,null,null,1,2,3,4,5,null,null,null,null,null,null,1,2,null,null,1,2,3,4,5,6,null,null,1,2,3,4,5,6]
[null,"●","●","●","●","○","○",null,null,null,null,null,"○","■","◆",null,"○","●","●","●","●","○","○",null,"○","●","●","●","●","○","○",null,null,null,null,"○","○","○","○",null,null,null,null,null,null,"◆","◆",null,null,"●","●","●","●","○","○",null,null,null,null,"●","●","○","○",null,null,null,null,null,null,null,"■",null,null,null,"●","●","●","○","○",null,null,null,null,null,"●","○","○",null,"■","○","○","○","○","■","■",null,null,null,"●","●","●","○","○",null,null,null,null,null,null,"○","◆",null,null,"●","●","●","●","○","○",null,null,"●","●","●","●","○","○"]
[7,8,9,10,11,12,13,null,4,5,6,7,8,9,10,null,8,9,10,11,12,13,14,null,8,9,10,11,12,13,14,null,5,6,7,8,9,10,11,null,3,4,5,6,7,8,9,null,7,8,9,10,11,12,13,null,5,6,7,8,9,10,11,null,2,3,4,5,6,7,8,null,6,7,8,9,10,11,12,null,4,5,6,7,8,9,10,null,8,9,10,11,12,13,14,null,6,7,8,9,10,11,12,null,3,4,5,6,7,8,9,null,7,8,9,10,11,12,13,null,7,8,9,10,11,12,13]
["○","●","●","●","●","○","○",null,"◆","●","●","●","●","○","○",null,"○","●","●","●","●","○","○",null,"○","○","○","○","○","○","○",null,"○","●","●","●","●","○","○",null,"◆","◆","◆","◆","●","○","○",null,"○","●","●","●","●","○","○",null,"○","●","●","●","●","○","○",null,"■","○","○","■","■","◆","◆",null,"○","●","●","●","●","○","○",null,"○","○","○","○","○","■","■",null,"■","○","○","○","○","■","■",null,"○","●","●","●","●","○","○",null,"◆","■","○","●","●","○","○",null,"○","●","●","○","○","○","○",null,"○","○","○","○","○","○","○"]
[14,15,16,17,18,19,20,null,11,12,13,14,15,16,17,null,15,16,17,18,19,20,21,null,15,16,17,18,19,20,21,null,12,13,14,15,16,17,18,null,10,11,12,13,14,15,16,null,14,15,16,17,18,19,20,null,12,13,14,15,16,17,18,null,9,10,11,12,13,14,15,null,13,14,15,16,17,18,19,null,11,12,13,14,15,16,17,null,15,16,17,18,19,20,21,null,13,14,15,16,17,18,19,null,10,11,12,13,14,15,16,null,14,15,16,17,18,19,20,null,14,15,16,17,18,19,20]
["○","●","●","●","●","○","○",null,"○","○","●","●","●","○","○",null,"○","●","●","●","●","○","○",null,"○","○","○","○","■","■","■",null,"○","●","●","●","●","○","○",null,"○","○","○","○","○","○","○",null,"○","●","●","●","●","○","○",null,"○","●","●","●","●","■","■",null,"■","○","■","■","■","■","◆",null,"○","●","●","●","●","◆","◆",null,"■","■","○","○","○","■","■",null,"■","○","○","○","○","■","■",null,"○","●","●","●","●","○","○",null,"○","○","●","●","●","○","○",null,"○","●","●","●","●","○","○",null,"○","○","○","○","○","■","■"]
[21,22,23,24,25,26,27,null,18,19,20,21,22,23,24,null,22,23,24,25,26,27,28,null,22,23,24,25,26,27,28,null,19,20,21,22,23,24,25,null,17,18,19,20,21,22,23,null,21,22,23,24,25,26,27,null,19,20,21,22,23,24,25,null,16,17,18,19,20,21,22,null,20,21,22,23,24,25,26,null,18,19,20,21,22,23,24,null,22,23,24,25,26,27,28,null,20,21,22,23,24,25,26,null,17,18,19,20,21,22,23,null,21,22,23,24,25,26,27,null,21,22,23,24,25,26,27]
["○","●","●","●","○","■","◆",null,"○","●","●","●","●","○","○",null,"○","○","●","●","●","○","○",null,"■","■","■","■","■","■","■",null,"○","●","●","●","●","○","○",null,"○","○","○","○","○","○","○",null,"○","●","●","●","●","○","○",null,"■","■","○","○","○","■","■",null,"◆","■","○","○","○","■","■",null,"◆","◆","◆","◆","●","○","○",null,"■","○","○","○","○","■","■",null,"■","■","○","○","○","■","■",null,"○","●","●","●","●","■","■",null,"○","●","●","●","●","○","○",null,"○","○","○","●","●","○","○",null,"■","■","■","■","■","■","■"]
[28,29,30,31,null,null,null,null,25,26,27,28,29,30,31,null,null,null,null,null,null,null,null,null,29,30,31,null,null,null,null,null,26,27,28,29,30,null,null,null,24,25,26,27,28,29,30,null,28,29,30,null,null,null,null,null,26,27,28,29,30,31,null,null,23,24,25,26,27,28,29,null,27,28,29,30,null,null,null,null,25,26,27,28,29,30,31,null,29,30,null,null,null,null,null,null,27,28,29,30,31,null,null,null,24,25,26,27,28,29,30,null,28,null,null,null,null,null,null,null,28,29,30,31]
["■","■","◆","■",null,null,null,null,"○","●","●","●","●","○","○",null,null,null,null,null,null,null,null,null,"■","■","■",null,null,null,null,null,"○","○","○","○","○",null,null,null,"○","○","○","○","○","○","○",null,"○","●","●",null,null,null,null,null,"■","○","○","○","○","■",null,null,"■","●","●","●","●","○","○",null,"○","●","●","●",null,null,null,null,"■","○","○","○","○","■","■",null,"■","●",null,null,null,null,null,null,"■","■","◆","◆","■",null,null,null,"○","●","●","●","●","○","○",null,"○",null,null,null,null,null,null,null,"■","■","■","■"]
[null,null,null,null,null,null,null,null,null,null,null,null,null,null,null,null,null,null,null,null,null,null,null,null,null,null,null,null,null,null,null,null,null,null,null,null,null,null,null,null,31,null,null,null,null,null,null,null,null,null,null,null,null,null,null,null,null,null,null,null,null,null,null,null,30,31,null,null,null,null,null,null,null,null,null,null,null,null,null,null,null,null,null,null,null,null,null,null,null,null,null,null,null,null,null,null,null,null,null,null,null,null,null,null,31]
[null,null,null,null,null,null,null,null,null,null,null,null,null,null,null,null,null,null,null,null,null,null,null,null,null,null,null,null,null,null,null,null,null,null,null,null,null,null,null,null,"○",null,null,null,null,null,null,null,null,null,null,null,null,null,null,null,null,null,null,null,null,null,null,null,"○","●",null,null,null,null,null,null,null,null,null,null,null,null,null,null,null,null,null,null,null,null,null,null,null,null,null,null,null,null,null,null,null,null,null,null,null,null,null,null,"○"]
[]
[null,"往路選択",null,{"$f":"計算シート!G13","v":0}]

{"sheet":"カレンダー ② ","index":2,"n_rows":18,"n_cols":127,"rows_kept":18,"cut":false,"hidden":false,"merged":[[3,0,3,6],[3,8,3,14],[5,0,6,0],[5,8,6,8],[13,51,14,51],[13,52,14,52],[13,53,14,53],[13,4,14,4],[13,5,14,5],[13,6,14,6],[13,27,14,27],[13,28,14,28],[13,29,14,29],[5,43,6,43],[5,44,6,44],[5,48,6,48],[5,9,6,9],[5,10,6,10],[5,11,6,11],[5,32,6,32],[5,33,6,33],[5,34,6,34],[5,40,6,40],[5,41,6,41],[17,1,19,2],[17,3,19,6],[72,6,73,6],[72,0,73,0],[72,1,73,1],[72,2,73,2],[72,3,73,3],[72,4,73,4],[72,5,73,5],[3,96,3,102],[3,104,3,110],[3,112,3,118],[5,106,6,106],[5,108,6,108],[5,112,6,112],[3,16,3,22],[3,24,3,30],[3,32,3,38],[3,40,3,46],[3,48,3,54],[5,42,6,42],[3,56,3,62],[3,64,3,70],[3,72,3,78],[3,80,3,86],[3,88,3,94],[5,73,6,73],[5,80,6,80],[5,81,6,81],[5,82,6,82],[5,83,6,83],[3,120,3,126],[13,30,14,30],[13,37,14,37],[13,38,14,38],[13,54,14,54],[13,62,14,62],[13,76,14,76],[13,77,14,77],[13,78,14,78],[5,107,6,107],[5,66,6,66],[5,67,6,67],[5,68,6,68],[5,69,6,69],[5,72,6,72],[5,56,6,56],[5,57,6,57],[5,58,6,58],[5,64,6,64],[5,65,6,65],[5,96,6,96],[5,97,6,97],[5,104,6,104],[5,105,6,105],[5,120,6,120],[13,102,14,102],[13,113,14,113],[13,114,14,114],[13,115,14,115],[13,90,14,90],[13,91,14,91],[13,92,14,92],[13,93,14,93],[13,94,14,94],[15,109,16,109],[15,110,16,110],[13,126,14,126],[15,41,16,41],[15,42,16,42],[15,43,16,43],[15,44,16,44],[15,45,16,45],[15,46,16,46],[15,66,16,66],[15,67,16,67],[15,68,16,68],[15,69,16,69],[15,70,16,70],[15,105,16,105],[15,106,16,106],[15,107,16,107],[15,108,16,108],[13,116,14,116],[13,117,14,117],[13,118,14,118],[13,124,14,124],[13,125,14,125],[13,101,14,101]]}
[]
[]
[]
["2025年 12月",null,null,null,null,null,null,null,"202６年 1月",null,null,null,null,null,null,null,"202６年 2月",null,null,null,null,null,null,null,"202６年 3月",null,null,null,null,null,null,null,"2026年 04月",null,null,null,null,null,null,null,"2026年 05月",null,null,null,null,null,null,null,"2026年 06月",null,null,null,null,null,null,null,"2026年 07月",null,null,null,null,null,null,null,"2026年 08月",null,null,null,null,null,null,null,"2026年 09月",null,null,null,null,null,null,null,"2026年 10月",null,null,null,null,null,null,null,"2026年 11月",null,null,null,null,null,null,null,"2026年 12月",null,null,null,null,null,null,null,"2027年 1月",null,null,null,null,null,null,null,"2027年 2月",null,null,null,null,null,null,null,"2027年 3月"]
["日","月","火","水","木","金","土",null,"日","月","火","水","木","金","土",null,"日","月","火","水","木","金","土",null,"日","月","火","水","木","金","土",null,"日","月","火","水","木","金","土",null,"日","月","火","水","木","金","土",null,"日","月","火","水","木","金","土",null,"日","月","火","水","木","金","土",null,"日","月","火","水","木","金","土",null,"日","月","火","水","木","金","土",null,"日","月","火","水","木","金","土",null,"日","月","火","水","木","金","土",null,"日","月","火","水","木","金","土",null,"日","月","火","水","木","金","土",null,"日","月","火","水","木","金","土",null,"日","月","火","水","木","金","土"]
[null,1,2,3,4,5,6,null,null,null,null,null,1,2,3,null,1,2,3,4,5,6,7,null,1,2,3,4,5,6,7,null,null,null,null,1,2,3,4,null,null,null,null,null,null,1,2,null,null,1,2,3,4,5,6,null,null,null,null,1,2,3,4,null,null,null,null,null,null,null,1,null,null,null,1,2,3,4,5,null,null,null,null,null,1,2,3,null,1,2,3,4,5,6,7,null,null,null,1,2,3,4,5,null,null,null,null,null,null,1,2,null,null,1,2,3,4,5,6,null,null,1,2,3,4,5,6]
[null,"●","●","●","●","○","○",null,null,null,null,null,"○","■","◆",null,"○","●","●","●","●","○","○",null,"○","●","●","●","●","○","○",null,null,null,null,"○","○","○","○",null,null,null,null,null,null,"◆","◆",null,null,"●","●","●","●","○","○",null,null,null,null,"●","●","○","○",null,null,null,null,null,null,null,"■",null,null,null,"●","●","●","○","○",null,null,null,null,null,"●","○","○",null,"■","○","○","○","○","■","■",null,null,null,"●","●","●","○","○",null,null,null,null,null,null,"○","◆",null,null,"●","●","●","●","○","○",null,null,"●","●","●","●","○","○"]
[7,8,9,10,11,12,13,null,4,5,6,7,8,9,10,null,8,9,10,11,12,13,14,null,8,9,10,11,12,13,14,null,5,6,7,8,9,10,11,null,3,4,5,6,7,8,9,null,7,8,9,10,11,12,13,null,5,6,7,8,9,10,11,null,2,3,4,5,6,7,8,null,6,7,8,9,10,11,12,null,4,5,6,7,8,9,10,null,8,9,10,11,12,13,14,null,6,7,8,9,10,11,12,null,3,4,5,6,7,8,9,null,7,8,9,10,11,12,13,null,7,8,9,10,11,12,13]
["○","●","●","●","●","○","○",null,"◆","●","●","●","●","○","○",null,"○","●","●","●","●","○","○",null,"○","○","○","○","○","○","○",null,"○","●","●","●","●","○","○",null,"◆","◆","◆","◆","●","○","○",null,"○","●","●","●","●","○","○",null,"○","●","●","●","●","○","○",null,"■","○","○","■","■","◆","◆",null,"○","●","●","●","●","○","○",null,"○","○","○","○","○","■","■",null,"■","○","○","○","○","■","■",null,"○","●","●","●","●","○","○",null,"◆","■","○","●","●","○","○",null,"○","●","●","○","○","○","○",null,"○","○","○","○","○","○","○"]
[14,15,16,17,18,19,20,null,11,12,13,14,15,16,17,null,15,16,17,18,19,20,21,null,15,16,17,18,19,20,21,null,12,13,14,15,16,17,18,null,10,11,12,13,14,15,16,null,14,15,16,17,18,19,20,null,12,13,14,15,16,17,18,null,9,10,11,12,13,14,15,null,13,14,15,16,17,18,19,null,11,12,13,14,15,16,17,null,15,16,17,18,19,20,21,null,13,14,15,16,17,18,19,null,10,11,12,13,14,15,16,null,14,15,16,17,18,19,20,null,14,15,16,17,18,19,20]
["○","●","●","●","●","○","○",null,"○","○","●","●","●","○","○",null,"○","●","●","●","●","○","○",null,"○","○","○","○","■","■","■",null,"○","●","●","●","●","○","○",null,"○","○","○","○","○","○","○",null,"○","●","●","●","●","○","○",null,"○","●","●","●","●","■","■",null,"■","○","■","■","■","■","◆",null,"○","●","●","●","●","◆","◆",null,"■","■","○","○","○","■","■",null,"■","○","○","○","○","■","■",null,"○","●","●","●","●","○","○",null,"○","○","●","●","●","○","○",null,"○","●","●","●","●","○","○",null,"○","○","○","○","○","■","■"]
[21,22,23,24,25,26,27,null,18,19,20,21,22,23,24,null,22,23,24,25,26,27,28,null,22,23,24,25,26,27,28,null,19,20,21,22,23,24,25,null,17,18,19,20,21,22,23,null,21,22,23,24,25,26,27,null,19,20,21,22,23,24,25,null,16,17,18,19,20,21,22,null,20,21,22,23,24,25,26,null,18,19,20,21,22,23,24,null,22,23,24,25,26,27,28,null,20,21,22,23,24,25,26,null,17,18,19,20,21,22,23,null,21,22,23,24,25,26,27,null,21,22,23,24,25,26,27]
["○","●","●","●","○","■","◆",null,"○","●","●","●","●","○","○",null,"○","○","●","●","●","○","○",null,"■","■","■","■","■","■","■",null,"○","●","●","●","●","○","○",null,"○","○","○","○","○","○","○",null,"○","●","●","●","●","○","○",null,"■","■","○","○","○","■","■",null,"◆","■","○","○","○","■","■",null,"◆","◆","◆","◆","●","○","○",null,"■","○","○","○","○","■","■",null,"■","■","○","○","○","■","■",null,"○","●","●","●","●","■","■",null,"○","●","●","●","●","○","○",null,"○","○","○","●","●","○","○",null,"■","■","■","■","■","■","■"]
[28,29,30,31,null,null,null,null,25,26,27,28,29,30,31,null,null,null,null,null,null,null,null,null,29,30,31,null,null,null,null,null,26,27,28,29,30,null,null,null,24,25,26,27,28,29,30,null,28,29,30,null,null,null,null,null,26,27,28,29,30,31,null,null,23,24,25,26,27,28,29,null,27,28,29,30,null,null,null,null,25,26,27,28,29,30,31,null,29,30,null,null,null,null,null,null,27,28,29,30,31,null,null,null,24,25,26,27,28,29,30,null,28,null,null,null,null,null,null,null,28,29,30,31]
["■","■","◆","■",null,null,null,null,"○","●","●","●","●","○","○",null,null,null,null,null,null,null,null,null,"■","■","■",null,null,null,null,null,"○","○","○","○","○",null,null,null,"○","○","○","○","○","○","○",null,"○","●","●",null,null,null,null,null,"■","○","○","○","○","■",null,null,"■","●","●","●","●","○","○",null,"○","●","●","●",null,null,null,null,"■","○","○","○","○","■","■",null,"■","●",null,null,null,null,null,null,"■","■","◆","◆","■",null,null,null,"○","●","●","●","●","○","○",null,"○",null,null,null,null,null,null,null,"■","■","■","■"]
[null,null,null,null,null,null,null,null,null,null,null,null,null,null,null,null,null,null,null,null,null,null,null,null,null,null,null,null,null,null,null,null,null,null,null,null,null,null,null,null,31,null,null,null,null,null,null,null,null,null,null,null,null,null,null,null,null,null,null,null,null,null,null,null,30,31,null,null,null,null,null,null,null,null,null,null,null,null,null,null,null,null,null,null,null,null,null,null,null,null,null,null,null,null,null,null,null,null,null,null,null,null,null,null,31]
[null,null,null,null,null,null,null,null,null,null,null,null,null,null,null,null,null,null,null,null,null,null,null,null,null,null,null,null,null,null,null,null,null,null,null,null,null,null,null,null,"○",null,null,null,null,null,null,null,null,null,null,null,null,null,null,null,null,null,null,null,null,null,null,null,"○","●",null,null,null,null,null,null,null,null,null,null,null,null,null,null,null,null,null,null,null,null,null,null,null,null,null,null,null,null,null,null,null,null,null,null,null,null,null,null,"○"]
[null,"復路選択",null,{"$f":"計算シート!G36","v":0}]

{"sheet":"ステップ①","index":3,"n_rows":28,"n_cols":15,"rows_kept":28,"cut":false,"hidden":false,"merged":[[4,12,6,13],[4,14,6,17],[12,12,14,13],[12,14,14,17],[27,12,29,13],[27,14,29,17]]}
[]
[]
[]
[]
[null,null,null,null,null,null,null,null,null,null,null,null,"出発駅",null,{"$f":"計算シート!C9","v":0}]
[]
[]
[]
[]
[]
[]
[]
[null,null,null,null,null,null,null,null,null,null,null,null,"起点駅",null,{"$f":"計算シート!C13","v":0}]
[]
[]
[]
[]
[]
[]
[]
{"$rows_left_out":9}
{"sheet":"ステップ②","index":4,"n_rows":30,"n_cols":14,"rows_kept":30,"cut":false,"hidden":false,"merged":[[4,11,6,12],[4,13,6,16],[18,11,20,12],[18,13,20,16],[29,11,31,12],[29,13,31,16]]}
[]
[]
[]
[]
[null,null,null,null,null,null,null,null,null,null,null,"乗車券料金区分",null,{"$f":"計算シート!G9","v":0}]
[]
[]
[]
[]
[]
[]
[]
[]
[]
[]
[]
[]
[]
[null,null,null,null,null,null,null,null,null,null,null,"特急券料金区分",null,{"$f":"計算シート!G16","v":0}]
[]
{"$rows_left_out":11}
{"sheet":"ステップ③","index":5,"n_rows":27,"n_cols":15,"rows_kept":27,"cut":false,"hidden":false,"merged":[[4,12,6,13],[4,14,6,17],[12,12,14,13],[12,14,14,17],[26,12,28,13],[26,14,28,17]]}
[]
[]
[]
[]
[null,null,null,null,null,null,null,null,null,null,null,null,"到着駅",null,{"$f":"計算シート!D32","v":0}]
[]
[]
[]
[]
[]
[]
[]
[null,null,null,null,null,null,null,null,null,null,null,null,"起点駅",null,{"$f":"計算シート!C36","v":0}]
[]
[]
[]
[]
[]
[]
[]
{"$rows_left_out":8}
{"sheet":"ステップ④","index":6,"n_rows":29,"n_cols":14,"rows_kept":29,"cut":false,"hidden":false,"merged":[[3,11,5,12],[3,13,5,16],[17,11,19,12],[17,13,19,16],[28,11,30,12],[28,13,30,16]]}
[]
[]
[]
[null,null,null,null,null,null,null,null,null,null,null,"乗車券料金区分",null,{"$f":"計算シート!G32","v":0}]
[]
[]
[]
[]
[]
[]
[]
[]
[]
[]
[]
[]
[]
[null,null,null,null,null,null,null,null,null,null,null,"特急券料金区分",null,{"$f":"計算シート!G40","v":0}]
[]
[]
{"$rows_left_out":10}
{"sheet":"条件シート","index":7,"n_rows":175,"n_cols":31,"rows_kept":175,"cut":false,"hidden":true,"merged":[[84,9,84,10],[118,9,118,10],[76,9,76,10],[76,12,76,13],[84,12,84,13],[118,12,118,13],[111,9,111,10],[111,12,111,13]]}
[]
["駅名",null,"1.通常期",0]
["居組",null,"2.最繁忙期",400,null,null,"普通料金"]
["諸寄",null,"3.繁忙期",200,null,null,null,"居組","諸寄","浜坂","久谷","香住","佐津","竹野","城崎温泉","豊岡","江原","八鹿","和田山","竹田","生野","寺前","福崎","姫路","加古川","西明石","明石","神戸","三ノ宮","大阪","鳥取"]
["浜坂",null,"4.閑散期",-200,null,null,"居組","-",null,200,240,420,590,680,860,990,1170,1340,1520,1690,1980,2310,2310,2640,3080,3410,3410,3740,3740,4070]
["久谷",null,null,null,null,null,"諸寄",null,"-",150,200,330,510,590,770,990,1170,1170,1520,1520,1980,2310,2310,2640,3080,3410,3410,3740,3740,4070]
[null,null,null,null,null,null,"浜坂",200,150,"-",200,330,420,590,680,860,990,1170,1340,1520,1980,1980,2310,2640,3080,3410,3410,3740,3740,4070,590]
["駅名",null,null,null,null,null,"久谷",null,null,200,"-",240,330,510,590,770,990,1170,1340,1340,1690,1980,2310,2640,3080,3080,3410,3740,3740,3740]
["居組",null,"普通乗車券割引",null,null,null,"香住",420,330,330,240,"-"]
["諸寄",null,"1.通常料金",1,null,null,"佐津",590,510,420,330,null,"-"]
["浜坂",null,"2.ジパング割（3割引）",0.7,null,null,"竹野",680,590,590,510,null,null,"-"]
["久谷",null,"3.ミドル割",0.95,null,null,"城崎温泉",860,770,680,590,null,null,null,"-"]
["香住",null,"4.学生割引",0.8,null,null,"豊岡",990,990,860,770,null,null,null,null,"-"]
["佐津",null,"5.往復割引",0.9,null,null,"江原",1170,1170,990,990,null,null,null,null,null,"-"]
["竹野",null,"6.小児割引",0.5,null,null,"八鹿",1340,1170,1170,1170,null,null,null,null,null,null,"-"]
["城崎温泉",null,"7.障害者割引",0.5,null,null,"和田山",1520,1520,1340,1340,null,null,null,null,null,null,null,"-"]
["豊岡",null,"8.ジパング割（2割引）",0.8,null,null,"竹田",1690,1520,1520,1340,null,null,null,null,null,null,null,null,"-"]
["江原",null,null,null,null,null,"生野",1980,1980,1980,1690,null,null,null,null,null,null,null,null,null,"-"]
["八鹿",null,null,null,null,null,"寺前",2310,2310,1980,1980,null,null,null,null,null,null,null,null,null,null,"-"]
["和田山",null,"1.切符あり",0,null,null,"福崎",2310,2310,2310,2310,null,null,null,null,null,null,null,null,null,null,null,"-"]
{"$rows_left_out":156}
{"sheet":"計算シート","index":8,"n_rows":54,"n_cols":9,"rows_kept":54,"cut":false,"hidden":false,"merged":[[53,7,53,8],[53,5,53,6],[3,1,3,8],[23,7,23,8],[24,7,24,8],[20,7,20,8],[21,7,21,8],[44,7,44,8],[45,7,45,8],[47,7,47,8],[48,7,48,8],[52,5,52,6],[52,7,52,8]]}
[]
[]
[]
[null,"特急はまかぜ利用助成金額　計算表"]
[]
[null,"往路"]
[null,"（乗車券）"]
[null,null,"出発駅","到着駅","料金",null,"割引","割引率","料金"]
[null,null,null,{"$f":"D13","v":0},{"$f":"IFERROR(INDEX(条件シート!$H$5:$AE$28,MATCH(C9,条件シート!H4:AE4,0),MATCH(D9,条件シート!H4:AE4,0)),\"\")","v":""},null,null,{"$f":"IFERROR(VLOOKUP(G9,条件シート!$C$10:$D$17,2),\"\")","v":""},{"$f":"IFERROR(ROUNDDOWN(E9*H9,-1),\"\")","v":""}]
[null,null,{"$f":"VLOOKUP(C9,条件シート!$J$80:$K$83,2)","v":{"$error":"#N/A"}},{"$f":"VLOOKUP(D9,条件シート!$J$87:$K$109,2)","v":{"$error":"#N/A"}}]
[null,"（特急券）"]
[null,null,"出発駅","到着駅","料金",null,"時期","加算料金","加算後"]
[null,null,null,null,{"$f":"IFERROR(INDEX(条件シート!$H$33:$AB$53,MATCH(C13,条件シート!H32:AB32,0),MATCH(D13,条件シート!H32:AB32,0)),\"\")","v":""},null,null,{"$f":"IFERROR(VLOOKUP(G13,条件シート!$C$2:$D$5,2),\"\")","v":""},{"$f":"IFERROR(E13+H13,\"\")","v":""}]
[null,null,{"$f":"VLOOKUP(C13,条件シート!$J$114:$K$117,2)","v":{"$error":"#N/A"}},{"$f":"VLOOKUP(D13,条件シート!J121:K143,2)","v":{"$error":"#N/A"}}]
[null,null,null,null,null,null,"割引","割引率","料金"]
[null,null,null,null,null,null,null,{"$f":"IFERROR(VLOOKUP(G16,条件シート!$C$26:$D$32,2),\"\")","v":""},{"$f":"IFERROR(ROUNDDOWN(I13*H16,-1),\"\")","v":""}]
[]
[null,null,null,null,null,null,"切符","割引額","料金"]
[null,null,null,null,null,null,"1.切符あり",{"$f":"IFERROR(VLOOKUP(G19,条件シート!$C$20:$D$22,2),\"\")","v":0},{"$f":"IFERROR(I16+H19,\"\")","v":""}]
[]
{"$rows_left_out":35}
{"sheet":"申請書","index":9,"n_rows":52,"n_cols":26,"rows_kept":52,"cut":false,"hidden":false,"merged":[[21,1,21,4],[21,5,21,12],[21,13,21,14],[21,15,21,25],[0,0,0,23],[2,3,2,25],[4,0,4,23],[13,4,13,23],[15,1,15,25],[16,1,16,25],[18,4,18,23],[20,1,20,25],[22,14,22,17],[23,14,23,17],[24,14,24,17],[24,20,25,25],[25,8,25,11],[26,1,26,5],[26,6,26,15],[26,16,26,20],[26,21,26,25],[22,1,25,4],[25,14,25,17],[22,20,23,25],[23,8,23,11],[24,5,25,7],[24,8,24,11],[24,12,25,12],[24,13,25,13],[22,5,23,7],[22,8,22,11],[22,12,23,12],[22,13,23,13],[27,1,27,5],[27,6,27,15],[27,16,27,19],[27,21,27,24],[28,1,28,5],[28,6,28,15],[28,16,28,19],[28,21,28,24],[29,1,29,5],[29,6,29,15],[29,16,29,19],[29,21,29,24],[30,1,30,5],[30,6,30,15],[30,16,30,19],[30,21,30,24],[41,1,41,5],[41,6,41,13],[41,14,41,18],[41,19,41,25],[31,1,31,5],[31,6,31,15],[31,16,31,19],[31,21,31,24],[32,1,32,20],[32,21,32,24],[34,1,34,25],[36,1,36,25],[37,1,37,24],[38,1,38,25],[40,1,40,23],[51,1,51,23],[6,18,6,25],[8,18,8,24],[10,18,10,25],[45,1,45,5],[45,6,45,25],[47,1,47,23],[48,9,48,17],[49,1,49,23],[50,1,50,25],[42,1,42,5],[42,6,42,25],[43,1,43,5],[43,6,43,25],[44,1,44,5],[44,6,44,25]]}
["様式第１号（第５条関係）"]
[]
[null,null,null,"令和　　年　　月　　日"]
[]
["新温泉町長　　様"]
[null,null,null,null,null,null,null,null,null,null,null,null,null,"申請者"]
[null,null,null,null,"　　　　　　　　　　　　　　　　　　　申請者　住　所　　　　　　　　　　　　　　",null,null,null,null,null,null,null,null,null,null,null,"住所"]
[]
[null,null,null,null,null,null,null,null,null,null,null,null,null,null,null,null,"氏名"]
[]
[null,null,null,null,"　　　　　　　　　　　　　　　　　　　　　　　氏　名　　　　　　　　　　　　㊞　",null,null,null,null,null,null,null,null,null,null,null,"電話"]
[]
[]
[null,null,null,null,"新温泉町特急はまかぜ利用助成金交付申請書兼請求書"]
[]
[null,"　新温泉町特急はまかぜ利用助成金の交付を受けたいので、新温泉町特急はまかぜ利用助成金交付要綱第５条の規定により、下記のとおり申請します。"]
[null,"　また、助成金の交付が決定された場合は、当該助成金を請求しますので、下記の口座に振り込んでください。"]
[]
[null,null,null,null,"記"]
[]
{"$rows_left_out":32}